像这样的一大堆,总体说编译链接时错误
/Users/zhangtianjian/Library/Developer/Xcode/DerivedData/ClothingOrders-bcmqkcjsfgyibbgetgiyczzqcerj/Build/Products/Debug-iphonesimulator/ClothingOrders.app/ClothingOrders normal i386
cd /Users/zhangtianjian/Desktop/SVN
setenv IPHONEOS_DEPLOYMENT_TARGET 6.1
setenv PATH "/Applications/Xcode.app/Contents/Developer/Platforms/iPhoneSimulator.platform/Developer/usr/bin:/Applications/Xcode.app/Contents/Developer/usr/bin:/usr/bin:/bin:/usr/sbin:/sbin"
/Applications/Xcode.app/Contents/Developer/Toolchains/XcodeDefault.xctoolchain/usr/bin/clang -arch i386 -isysroot /Applications/Xcode.app/Contents/Developer/Platforms/iPhoneSimulator.platform/Developer/SDKs/iPhoneSimulator6.1.sdk -L/Users/zhangtianjian/Library/Developer/Xcode/DerivedData/ClothingOrders-bcmqkcjsfgyibbgetgiyczzqcerj/Build/Products/Debug-iphonesimulator -L/Users/zhangtianjian/Desktop/SVN/ZBarSDK -F/Users/zhangtianjian/Library/Developer/Xcode/DerivedData/ClothingOrders-bcmqkcjsfgyibbgetgiyczzqcerj/Build/Products/Debug-iphonesimulator -filelist /Users/zhangtianjian/Library/Developer/Xcode/DerivedData/ClothingOrders-bcmqkcjsfgyibbgetgiyczzqcerj/Build/Intermediates/ClothingOrders.build/Debug-iphonesimulator/ClothingOrders.build/Objects-normal/i386/ClothingOrders.LinkFileList -Xlinker -objc_abi_version -Xlinker 2 -fobjc-link-runtime -Xlinker -no_implicit_dylibs -mios-simulator-version-min=6.1 -lz -framework MobileCoreServices -framework SystemConfiguration -framework CFNetwork -framework CoreData -liconv -framework QuartzCore -framework CoreVideo -framework CoreMedia -framework AVFoundation -framework UIKit -framework Foundation -framework CoreGraphics -lzbar -o /Users/zhangtianjian/Library/Developer/Xcode/DerivedData/ClothingOrders-bcmqkcjsfgyibbgetgiyczzqcerj/Build/Products/Debug-iphonesimulator/ClothingOrders.app/ClothingOrders
duplicate symbol _OBJC_METACLASS_$_EntityOrdersTotal in:
/Users/zhangtianjian/Library/Developer/Xcode/DerivedData/ClothingOrders-bcmqkcjsfgyibbgetgiyczzqcerj/Build/Intermediates/ClothingOrders.build/Debug-iphonesimulator/ClothingOrders.build/Objects-normal/i386/EntityOrdersTotal-1502FC93349A1D59.o
duplicate symbol _OBJC_CLASS_$_EntityOrdersTotal in:
/Users/zhangtianjian/Library/Developer/Xcode/DerivedData/ClothingOrders-bcmqkcjsfgyibbgetgiyczzqcerj/Build/Intermediates/ClothingOrders.build/Debug-iphonesimulator/ClothingOrders.build/Objects-normal/i386/EntityOrdersTotal-1502FC93349A1D59.o
ld: 2 duplicate symbols for architecture i386
clang: error: linker command failed with exit code 1 (use -v to see invocation)
ios开发这个错误一定少不了,现总结如下,一般这三方面的问题,如果不是哪你真可麻烦了
1.引用出错,把***.h弄成了.m,检查一下你的所有引用;
2.再就是你引用第三方的库,你添加文件是系统没有所第三方库的.m文件参入的编译中去,你向项目添加文件得注意了;
3.就是不小心添加的重复的类,向Entity之类,具体你可以看这里http://*.com/questions/2264455/iphone-duplicate-symbol-error
顺便说一下http://*.com/这个网站是iso开发不可少的一个网站;
4.有些frameworks没有添加进来也会出现上面的问题;
如果有第五的,请留言!
(转) error: linker command failed with exit code 1 (use -v to see invocation)的更多相关文章
-
clang: error: linker command failed with exit code 1 (use -v to see invocation)
报错提示: ... ld: 6 duplicate symbols for architecture x86_64 clang: error: linker command failed with e ...
-
使用SVN clang: error: linker command failed with exit code 1 (use -v to see invocation)
然后上传到该项目SVN仓库上,例如,下面的错误再次发生再拉到本地编译 ld: library not found for -lxxxxxxxxxxxx clang: error: linker com ...
-
";_OBJC_CLASS_$_ALAssetsLibrary";, referenced from:和clang: error: linker command failed with exit code 1 (use -v to see invocation)错误
在项目中使用MWPhotoBrowser未导入ALAssetsLibrary类库时会导致编译时出现异常: "_OBJC_CLASS_$_ALAssetsLibrary", refe ...
-
iOS cocoapods导入项目 出现 ";___gxx_personality_v0";, referenced from: 或者 clang: error: linker command failed with exit code 1 (use -v to see invocation) 错误
今天想导入PNChart 编译的时候出现了 "___gxx_personality_v0", referenced from: 和 clang: error: linker c ...
-
Error:linker command failed with exit code 1 (use -v to see invocation) - iOS
今天在操作 CoreData 时,创建完 Create NSManagedObject Subclass... 后,工程中会自动生成四个文件,如下图所示: 此时此刻便以工程,激动人心的时刻来临了 ...
-
clang: error: linker command failed with exit code 1 (use -v to see invocation) 无法定位的问题
编译出现错误:linker command failed with exit code 1 找到Build settings->Linking->Other Linker Flags,将此 ...
-
解决了clang: error: linker command failed with exit code 1 (use -v to see invocation) 解决方法
1.”Build Settings”->”Enable Bitcode”设置为NO 2.TARGETS --> Build Settings --> Architectures - ...
-
Apple Mach-O Linker Error Group 与 ";_OBJC_CLASS_$_XXXXXX";, referenced from: 和 clang: error: linker command failed with exit code 1 (use -v to see invocation) 问题.
此问题为链接报错,在Build Settings中的Other Linker Flags添加:-l"XXXXXX"
-
svn中第一次check out working copy项目下来出现 ld: library not found for -lcrypto clang: error: linker command failed with exit code 1 (use -v to see invocation)
这个问题主要是.a文件的忽略删除,需要更改设置,并且把文件重新添加
随机推荐
-
CSS3制作心形头像
1.功能需求: 最近有一个基于微信开发的Mobile Web项目,是一个活动页面.功能需求:用户使用微信扫描二维码,然后授权使用微信登录,然后读取用户的昵称和头像,然后显示在一个饼图上面.头像需要有一 ...
-
javax.servlet.ServletException: Error instantiating servlet class Compiler 错误
javax.servlet.ServletException: Error instantiating servlet class Compiler org.apache.catalina.authe ...
-
问题-某个程序改了ICO图标后编译后还是显示老图标?
问题现象:某个程序改了ICO图标后编译后还是显示老图标? 问题原原:可能是因为系统的缓存问题. 问题处理:把程序的EXE放在别的路径下打开就可以了. 问题相关人员:QQ253120114(朋友) Q ...
-
javaweb代码生成器,专注于javaweb项通用目的代码生成器
该项目为javaWEB项目通用代码生成器,根据数据库表和自定义代码模板生成相应的jsp,js,java文件,生成到指定路径下,javaweb项目开发利器: 项目开源地址:https://gitee.c ...
-
将double或则float类型保留小数
DecimalFormat df=new DecimalFormat("0.0");//“0.00” df.format(price);
-
wed开发基础--练习题
一.HTML部分 本小节重点: 熟练使用div+span布局,知道div和span的语义化的意思 熟悉对div.ul.li.span.a.img.table.form.input标签有深刻的认知, 初 ...
-
Hadoop家族学习路线、实践案例
作者:Han Hsiao链接:https://www.zhihu.com/question/19795366/answer/24524910来源:知乎著作权归作者所有.商业转载请联系作者获得授权,非商 ...
-
联合权值dp
联合权值 洛谷中可找到 题目传送门https://www.luogu.org/problemnew/show/P1351 这题我就得了70分(TLE) GG了 就是遍历它孩子的孩子(爷爷和孙子),然 ...
-
Docker基础概念及操作
一.概念: Docker 属于Linux 容器的一种封装,提供简单易用的容器使用接口.目前最流行的Linux 容器解决方案. Docker 将应用程序与该程序的依赖,打包在一个文件里面.运行这个文件, ...
-
iPhone与Android手机 各个型号的UserAgent
摘要:userAgent 属性是一个只读的字符串,声明了浏览器用于 HTTP 请求的用户代理头的值.一般来讲,它是在navigator.appCodeName 的值之后加上斜线和navigator.a ...